Target
CDK-activating kinase assembly factor MAT1/Cyclin-H/Cyclin-dependent kinase 7
Ligand
BDBM31545
Substrate
Meas. Tech.
ChEMBL_1810514 (CHEMBL4309974)
IC50
270±n/a nM
Citation
 Jorda, RHendrychová, DVoller, J?ezní?ková, EGucký, TKry?tof, V How Selective Are Pharmacological Inhibitors of Cell-Cycle-Regulating Cyclin-Dependent Kinases? J Med Chem 61:9105-9120 (2018)  
Target
Name:
CDK-activating kinase assembly factor MAT1/Cyclin-H/Cyclin-dependent kinase 7
Synonyms:
CDK-activating kinase assembly factor MAT1/Cyclin H/Cyclin-dependent kinase 7 | CDK7/Cyclin H/MNAT1
Type:
Protein
Mol. Mass.:
Description:
Components:
This complex has 3 components.
Component 1
Name:
Cyclin-dependent kinase 7
Synonyms:
39 kDa protein kinase CAK1 CDK-activating kinase 1 (CAK) CDK7_HUMAN Cell division protein kinase 7 Cyclin-dependent kinase 7 (CDK7/cyclin H) P39 Mo15 TFIIH basal transcription factor complex kinase subunit
Type:
Enzyme Subunit
Mol. Mass.:
39047.01
Organism:
Homo sapiens (Human)
Description:
Residue:
346
  
Component 2
Name:
Cyclin-H
Synonyms:
CCNH Cyclin H p34 | p37
Type:
Enzyme Subunit
Mol. Mass.:
37646.05
Organism:
Homo sapiens (Human)
Description:
Residue:
323
  
Component 3
Name:
CDK-activating kinase assembly factor MAT1
Synonyms:
CAP35 Cyclin-G1-interacting protein MAT1_HUMAN Menage a trois RING finger protein MAT1 p35 | p36
Type:
Enzyme
Mol. Mass.:
35820.03
Organism:
Homo sapiens (Human)
Description:
P51948
Residue:
309
  
Inhibitor
Name:
BDBM31545
Synonyms:
Milciclib | pyrazolo[4,3-h]quinazoline-3-carboxamide, 28
Type:
Small organic molecule
Emp. Form.:
C25H32N8O
Mol. Mass.:
460.5746
SMILES:
CNC(=O)c1nn(C)c-2c1C(C)(C)Cc1cnc(Nc3ccc(cc3)N3CCN(C)CC3)nc-21
: