Target
Mitogen-activated protein kinase 14
Ligand
BDBM50503388
Substrate
Meas. Tech.
ChEMBL_1810649 (CHEMBL4310109)
Kd
0.470000±n/a nM
Citation
 Divakaran, ATalluri, SKAyoub, AMMishra, NKCui, HWiden, JCBerndt, NZhu, JYCarlson, ASTopczewski, JJSchonbrunn, EKHarki, DAPomerantz, WCK Molecular Basis for the N-Terminal Bromodomain-and-Extra-Terminal-Family Selectivity of a Dual Kinase-Bromodomain Inhibitor. J Med Chem 61:9316-9334 (2018)  
Target
Name:
Mitogen-activated protein kinase 14
Synonyms:
CSAID-binding protein CSBP1 CSPB1 MAP kinase 14 MAP kinase p38 alpha MAPK14 MK14_HUMAN Mitogen-activated protein kinase p38 alpha Stress-activated protein kinase 2a | p38 MAP kinase alpha/beta
Type:
Serine/threonine-protein kinase
Mol. Mass.:
41286.76
Organism:
Homo sapiens (Human)
Description:
Q16539
Residue:
360
  
Inhibitor
Name:
BDBM50503388
Synonyms:
CHEMBL4521096
Type:
Small organic molecule
Emp. Form.:
C26H27FN6
Mol. Mass.:
442.5312
SMILES:
Cc1cc(C)cc(Nc2nccc(n2)-c2c(ncn2C2CCNCC2)-c2ccc(F)cc2)c1
: