Target
Adenosine receptor A1
Ligand
BDBM50053937
Substrate
Meas. Tech.
ChEMBL_29459 (CHEMBL642188)
Ki
7.55±n/a nM
Citation
 Poulsen, SAQuinn, RJ Synthesis and structure-activity relationship of pyrazolo[3,4-d]pyrimidines: potent and selective adenosine A1 receptor antagonists. J Med Chem 39:4156-61 (1996)  
Target
Name:
Adenosine receptor A1
Synonyms:
AA1R_RAT ADENOSINE A1 high Adenosine A1 receptor (A1) Adenosine receptors A1 | Adora1
Type:
Protein
Mol. Mass.:
36704.13
Organism:
Rattus norvegicus (rat)
Description:
Residue:
326
  
Inhibitor
Name:
BDBM50053937
Synonyms:
2-(4-Methylsulfanyl-1-phenyl-1H-pyrazolo[3,4-d]pyrimidin-6-ylsulfanyl)-pentanoic acid amide | CHEMBL338723
Type:
Small organic molecule
Emp. Form.:
C17H19N5OS2
Mol. Mass.:
373.496
SMILES:
CCCC(Sc1nc(SC)c2cnn(-c3ccccc3)c2n1)C(N)=O
: