Target
Metabotropic glutamate receptor 6
Ligand
BDBM50503456
Substrate
Meas. Tech.
ChEMBL_1811009 (CHEMBL4310469)
IC50
>30000±n/a nM
Citation
 Childress, ESWieting, JMFelts, ASBreiner, MMLong, MFLuscombe, VBRodriguez, ALCho, HPBlobaum, ALNiswender, CMEmmitte, KAConn, PJLindsley, CW Discovery of Novel Central Nervous System Penetrant Metabotropic Glutamate Receptor Subtype 2 (mGlu J Med Chem 62:378-384 (2019)  
Target
Name:
Metabotropic glutamate receptor 6
Synonyms:
GPRC1F GRM6_HUMAN Metabotropic glutamate receptor 6 metabotropic glutamate 6
Type:
Enzyme Catalytic Domain
Mol. Mass.:
95479.26
Organism:
Homo sapiens (Human)
Description:
metabotropic glutamate 6 GRM6 HUMAN::O15303
Residue:
877
  
Inhibitor
Name:
BDBM50503456
Synonyms:
CHEMBL4435396
Type:
Small organic molecule
Emp. Form.:
C20H13F4N5O2
Mol. Mass.:
431.3431
SMILES:
NC(=O)c1cc(-c2ccc(F)cc2)n2nc(COc3ccnc(c3)C(F)(F)F)cc2n1
: