Target
Metabotropic glutamate receptor 6
Ligand
BDBM50503462
Substrate
Meas. Tech.
ChEMBL_1811009 (CHEMBL4310469)
IC50
>30000±n/a nM
Citation
 Childress, ESWieting, JMFelts, ASBreiner, MMLong, MFLuscombe, VBRodriguez, ALCho, HPBlobaum, ALNiswender, CMEmmitte, KAConn, PJLindsley, CW Discovery of Novel Central Nervous System Penetrant Metabotropic Glutamate Receptor Subtype 2 (mGlu J Med Chem 62:378-384 (2019)  
Target
Name:
Metabotropic glutamate receptor 6
Synonyms:
GPRC1F GRM6_HUMAN Metabotropic glutamate receptor 6 metabotropic glutamate 6
Type:
Enzyme Catalytic Domain
Mol. Mass.:
95479.26
Organism:
Homo sapiens (Human)
Description:
metabotropic glutamate 6 GRM6 HUMAN::O15303
Residue:
877
  
Inhibitor
Name:
BDBM50503462
Synonyms:
CHEMBL4527834
Type:
Small organic molecule
Emp. Form.:
C21H22FN3O2S
Mol. Mass.:
399.482
SMILES:
C[C@H]1CN(Cc2cc3nc(cc(-c4ccc(F)cc4)c3s2)C(N)=O)C[C@@H](C)O1
: