Target
Lysine-specific histone demethylase 1A
Ligand
BDBM50155773
Substrate
Meas. Tech.
ChEMBL_1811200 (CHEMBL4310660)
IC50
11±n/a nM
Citation
 Duan, YQin, WSuo, FZhai, XGuan, YWang, XZheng, YLiu, H Design, synthesis and in vitro evaluation of stilbene derivatives as novel LSD1 inhibitors for AML therapy. Bioorg Med Chem 26:6000-6014 (2018)  
Target
Name:
Lysine-specific histone demethylase 1A
Synonyms:
AOF2 Flavin-containing amine oxidase domain-containing protein 2 KDM1A KIAA0601 Lysine-specific demethylase 1 (LSD1) Lysine-specific histone demethylase 1 (LSD1)
Type:
Enzyme
Mol. Mass.:
92901.01
Organism:
Homo sapiens (Human)
Description:
O60341
Residue:
852
  
Inhibitor
Name:
BDBM50155773
Synonyms:
CHEMBL3781751 | US9469597, 5
Type:
Small organic molecule
Emp. Form.:
C15H22N2
Mol. Mass.:
230.3486
SMILES:
[H][C@@]1(CC[C@H](N)CC1)N[C@@H]1C[C@H]1c1ccccc1
: