Target
Acyl-CoA:cholesterol acyltransferase
Ligand
BDBM50054306
Substrate
Meas. Tech.
ChEMBL_28664 (CHEMBL649062)
IC50
73±n/a nM
Citation
 White, ADCreswell, MWChucholowski, AWBlankley, CJWilson, MWBousley, RFEssenburg, ADHamelehle, KLKrause, BRStanfield, RLDominick, MANeub, M Heterocyclic ureas: inhibitors of acyl-CoA:cholesterol O-acyltransferase as hypocholesterolemic agents. J Med Chem 39:4382-95 (1996)  
Target
Name:
Acyl-CoA:cholesterol acyltransferase
Synonyms:
ACAT
Type:
Mol. Mass.:
35405.31
Organism:
Oryctolagus cuniculus
Description:
Residue:
305
  
Inhibitor
Name:
BDBM50054306
Synonyms:
1-(2,6-Diisopropyl-phenyl)-3-(2-hexyl-2,3-dihydro-1H-tetrazol-5-yl)-urea | CHEMBL138070
Type:
Small organic molecule
Emp. Form.:
C20H34N6O
Mol. Mass.:
374.5236
SMILES:
CCCCCCN1NN=C(NC(=O)Nc2c(cccc2C(C)C)C(C)C)N1
: