Target
Acyl-CoA:cholesterol acyltransferase
Ligand
BDBM50054291
Substrate
Meas. Tech.
ChEMBL_28664 (CHEMBL649062)
IC50
210±n/a nM
Citation
 White, ADCreswell, MWChucholowski, AWBlankley, CJWilson, MWBousley, RFEssenburg, ADHamelehle, KLKrause, BRStanfield, RLDominick, MANeub, M Heterocyclic ureas: inhibitors of acyl-CoA:cholesterol O-acyltransferase as hypocholesterolemic agents. J Med Chem 39:4382-95 (1996)  
Target
Name:
Acyl-CoA:cholesterol acyltransferase
Synonyms:
ACAT
Type:
Mol. Mass.:
35405.31
Organism:
Oryctolagus cuniculus
Description:
Residue:
305
  
Inhibitor
Name:
BDBM50054291
Synonyms:
1-(2,6-Diisopropyl-phenyl)-3-(1-dodecyl-1H-tetrazol-5-yl)-urea | CHEMBL136914
Type:
Small organic molecule
Emp. Form.:
C26H44N6O
Mol. Mass.:
456.6672
SMILES:
CCCCCCCCCCCCn1nnnc1NC(=O)Nc1c(cccc1C(C)C)C(C)C
: