Target
Carbonic anhydrase 2
Ligand
BDBM50503781
Substrate
Meas. Tech.
ChEMBL_1812146 (CHEMBL4311606)
Kd
0.018000±n/a nM
Citation
 Va?kevi?ien?, IPaketuryt?, VPajanok, N?ukauskas, ?Sapijanskait?, BKantminien?, KMickevi?ius, VZubrien?, AMatulis, D Pyrrolidinone-bearing methylated and halogenated benzenesulfonamides as inhibitors of carbonic anhydrases. Bioorg Med Chem 27:322-337 (2019)  
Target
Name:
Carbonic anhydrase 2
Synonyms:
CA-II CAC Carbonate dehydratase II Carbonic anhydrase 2 (CA-II) Carbonic anhydrase C Carbonic anhydrase II (CA-II) Carbonic anhydrase II (hCA II) | Carbonic anhydrase isoenzyme II (hCA II)
Type:
Enzyme
Mol. Mass.:
29250.71
Organism:
Homo sapiens (Human)
Description:
P00918
Residue:
260
  
Inhibitor
Name:
BDBM50503781
Synonyms:
CHEMBL4464359
Type:
Small organic molecule
Emp. Form.:
C20H22ClN5O4S2
Mol. Mass.:
496.003
SMILES:
Cc1cc(N2CC(CC2=O)C(=O)NNC(=S)Nc2ccccc2)c(Cl)c(C)c1S(N)(=O)=O
: