Target
Type-1 angiotensin II receptor
Ligand
BDBM50503894
Substrate
Meas. Tech.
ChEMBL_1812409 (CHEMBL4311869)
Ki
1.3±n/a nM
Citation
 McKinnell, RMFatheree, PChoi, SKGendron, RJendza, KOlson Blair, BBudman, JHill, CMHegde, LGYu, CMcConn, DHegde, SSMarquess, DGKlein, U Discovery of TD-0212, an Orally Active Dual Pharmacology AT ACS Med Chem Lett 10:86-91 (2019)  
Target
Name:
Type-1 angiotensin II receptor
Synonyms:
AGTR1 AGTR1B AT1 AT1BR AT2R1B Angiotensin II receptor Type-1 angiotensin II receptor (AT1)
Type:
Protein
Mol. Mass.:
41080.75
Organism:
Homo sapiens (Human)
Description:
P30556
Residue:
359
  
Inhibitor
Name:
BDBM50503894
Synonyms:
CHEMBL4591218
Type:
Small organic molecule
Emp. Form.:
C29H37N3O4S
Mol. Mass.:
523.687
SMILES:
CCOc1nc(CC)c(CNC(=O)[C@@H](CS)CC(C)C)n1Cc1ccc(cc1)-c1ccccc1C(O)=O
: