Target
Fibroblast growth factor receptor 1
Ligand
BDBM50504106
Substrate
Meas. Tech.
ChEMBL_1813528 (CHEMBL4313102)
Ki
10.0±n/a nM
Citation
 Wang, YDai, YWu, XLi, FLiu, BLi, CLiu, QZhou, YWang, BZhu, MCui, RTan, XXiong, ZLiu, JTan, MXu, YGeng, MJiang, HLiu, HAi, JZheng, M Discovery and Development of a Series of Pyrazolo[3,4- J Med Chem 62:7473-7488 (2019)  
Target
Name:
Fibroblast growth factor receptor 1
Synonyms:
BFGFR Basic fibroblast growth factor receptor 1 (FGFR1) CEK FGFR-1 FGFR-1, (FL) FGFR1_HUMAN FLT2 Fibroblast growth factor receptor 1 (FGFR-1) Fms-like tyrosine kinase 2 N-sam bFGF-R | c-fgr
Type:
Receptor
Mol. Mass.:
91861.70
Organism:
Homo sapiens (Human)
Description:
P11362
Residue:
822
  
Inhibitor
Name:
BDBM50504106
Synonyms:
CHEMBL4462946
Type:
Small organic molecule
Emp. Form.:
C26H24ClN7O3
Mol. Mass.:
517.967
SMILES:
CN(C)C\C=C\C(=O)Nc1ccc(cc1)-n1nc2c(c1-c1oc3ccc(Cl)cc3c1C)c(N)n[nH]c2=O
: