Target
Genome polyprotein
Ligand
BDBM50055226
Substrate
Meas. Tech.
ChEMBL_393 (CHEMBL615643)
Ki
27±n/a nM
Citation
 Webber, SETikhe, JWorland, STFuhrman, SAHendrickson, TFMatthews, DALove, RAPatick, AKMeador, JWFerre, RABrown, ELDeLisle, DMFord, CEBinford, SL Design, synthesis, and evaluation of nonpeptidic inhibitors of human rhinovirus 3C protease. J Med Chem 39:5072-82 (1997)  
Target
Name:
Genome polyprotein
Synonyms:
Human rhinovirus A protease | Human rhinovirus B 3A protease
Type:
PROTEIN
Mol. Mass.:
44361.04
Organism:
Human rhinovirus B
Description:
ChEMBL_158953
Residue:
401
  
Inhibitor
Name:
BDBM50055226
Synonyms:
2,3-Dioxo-1-(3-phenyl-propyl)-2,3-dihydro-1H-indole-5-carboxylic acid amide | CHEMBL149227
Type:
Small organic molecule
Emp. Form.:
C18H16N2O3
Mol. Mass.:
308.3312
SMILES:
NC(=O)c1ccc2N(CCCc3ccccc3)C(=O)C(=O)c2c1
: