Target
Phospholipase A2, membrane associated
Ligand
BDBM50055310
Substrate
Meas. Tech.
ChEMBL_156192 (CHEMBL761443)
IC50
3680±n/a nM
Citation
 Dillard, RDBach, NJDraheim, SEBerry, DRCarlson, DGChirgadze, NYClawson, DKHartley, LWJohnson, LMJones, NDMcKinney, ERMihelich, EDOlkowski, JLSchevitz, RWSmith, ACSnyder, DWSommers, CDWery, JP Indole inhibitors of human nonpancreatic secretory phospholipase A2. 2. Indole-3-acetamides with additional functionality. J Med Chem 39:5137-58 (1997)  
Target
Name:
Phospholipase A2, membrane associated
Synonyms:
GIIC sPLA2 NPS-PLA2 Non-pancreatic secretory phospholipase A2 (hnps-PLA2) PLA2B PLA2L Phospholipase A2 group IIA | RASF-A
Type:
Hydrolase
Mol. Mass.:
16101.20
Organism:
Homo sapiens (Human)
Description:
The human nps PLA2 was cloned, and expressed in E. coli. There was a refolding process in the purification.
Residue:
144
  
Inhibitor
Name:
BDBM50055310
Synonyms:
CHEMBL343906 | Sodium salt of (1-Benzyl-3-carbamoyl-1H-indol-5-yloxymethyl)-phosphonic acid
Type:
Small organic molecule
Emp. Form.:
C18H17N2O5P
Mol. Mass.:
372.3128
SMILES:
NC(=O)Cc1cn(Cc2ccccc2)c2ccc(OCP([O-])([O-])=O)cc12
: