Target
Phospholipase A2
Ligand
BDBM50055366
Substrate
Meas. Tech.
ChEMBL_156054 (CHEMBL760630)
IC50
228±n/a nM
Citation
 Draheim, SEBach, NJDillard, RDBerry, DRCarlson, DGChirgadze, NYClawson, DKHartley, LWJohnson, LMJones, NDMcKinney, ERMihelich, EDOlkowski, JLSchevitz, RWSmith, ACSnyder, DWSommers, CDWery, JP Indole inhibitors of human nonpancreatic secretory phospholipase A2. 3. Indole-3-glyoxamides. J Med Chem 39:5159-75 (1997)  
Target
Name:
Phospholipase A2
Synonyms:
Group IB phospholipase A2 PLA2 PLA2G1B Phosphatidylcholine 2-acylhydrolase 1B Phospholipase A2 group 1B | phospholipase A2 precursor
Type:
Protein
Mol. Mass.:
16364.13
Organism:
Homo sapiens (Human)
Description:
P04054
Residue:
148
  
Inhibitor
Name:
BDBM50055366
Synonyms:
(3-Aminooxalyl-1-benzyl-2-ethyl-1H-indol-4-yloxy)-acetic acid 2-(3-(2-amino-2-oxoacetyl)-1-benzyl-2-ethyl-1H-indol-4-yloxy)acetic acid Varespladib sodium
Type:
Small organic molecule
Emp. Form.:
C21H20N2O5
Mol. Mass.:
380.3939
SMILES:
CCc1c(C(=O)C(N)=O)c2c(OCC(O)=O)cccc2n1Cc1ccccc1
: