Target
Carbonic anhydrase 2
Ligand
BDBM50504940
Substrate
Meas. Tech.
ChEMBL_1816911 (CHEMBL4316485)
Kd
0.020000±n/a nM
Citation
 Zak?auskas, A?apkauskait?, EJezep?ikas, LLinkuvien?, VPaketuryt?, VSmirnov, ALeitans, JKazaks, ADvinskis, EManakova, EGra?ulis, STars, KMatulis, D Halogenated and di-substituted benzenesulfonamides as selective inhibitors of carbonic anhydrase isoforms. Eur J Med Chem 185:0 (2020)  
Target
Name:
Carbonic anhydrase 2
Synonyms:
CA-II CAC Carbonate dehydratase II Carbonic anhydrase 2 (CA-II) Carbonic anhydrase C Carbonic anhydrase II (CA-II) Carbonic anhydrase II (hCA II) | Carbonic anhydrase isoenzyme II (hCA II)
Type:
Enzyme
Mol. Mass.:
29250.71
Organism:
Homo sapiens (Human)
Description:
P00918
Residue:
260
  
Inhibitor
Name:
BDBM50504940
Synonyms:
CHEMBL4475073
Type:
Small organic molecule
Emp. Form.:
C16H23ClN2O4S2
Mol. Mass.:
406.948
SMILES:
NS(=O)(=O)c1cc(C(=O)NCCCO)c(SC2CCCCC2)cc1Cl
: