Target
D(2) dopamine receptor
Ligand
BDBM50056023
Substrate
Meas. Tech.
ChEMBL_62255 (CHEMBL675482)
Ki
4.1±n/a nM
Citation
 Kuipers, WKruse, CGvan Wijngaarden, IStandaar, PJTulp, MTVeldman, NSpek, ALIJzerman, AP 5-HT1A-versus D2-receptor selectivity of flesinoxan and analogous N4-substituted N1-arylpiperazines. J Med Chem 40:300-12 (1997)  
Target
Name:
D(2) dopamine receptor
Synonyms:
DOPAMINE D2 DOPAMINE D2 Short Dopamine D2 receptor Drd2
Type:
G Protein-Coupled Receptor (GPCR)
Mol. Mass.:
50931.60
Organism:
Rattus norvegicus (rat)
Description:
P61169
Residue:
444
  
Inhibitor
Name:
BDBM50056023
Synonyms:
1-[(E)-4-(4-Fluoro-phenyl)-but-3-enyl]-4-(2-methoxy-phenyl)-piperazine | CHEMBL104805
Type:
Small organic molecule
Emp. Form.:
C21H25FN2O
Mol. Mass.:
340.4344
SMILES:
COc1ccccc1N1CCN(CC\C=C\c2ccc(F)cc2)CC1
: