Target
D(2) dopamine receptor
Ligand
BDBM50056034
Substrate
Meas. Tech.
ChEMBL_62255 (CHEMBL675482)
Ki
23±n/a nM
Citation
 Kuipers, WKruse, CGvan Wijngaarden, IStandaar, PJTulp, MTVeldman, NSpek, ALIJzerman, AP 5-HT1A-versus D2-receptor selectivity of flesinoxan and analogous N4-substituted N1-arylpiperazines. J Med Chem 40:300-12 (1997)  
Target
Name:
D(2) dopamine receptor
Synonyms:
DOPAMINE D2 DOPAMINE D2 Short Dopamine D2 receptor Drd2
Type:
G Protein-Coupled Receptor (GPCR)
Mol. Mass.:
50931.60
Organism:
Rattus norvegicus (rat)
Description:
P61169
Residue:
444
  
Inhibitor
Name:
BDBM50056034
Synonyms:
CHEMBL108229 | Cyclohexanecarboxylic acid {2-[4-(2-methoxy-phenyl)-piperazin-1-yl]-ethyl}-amide
Type:
Small organic molecule
Emp. Form.:
C20H31N3O2
Mol. Mass.:
345.479
SMILES:
COc1ccccc1N1CCN(CCNC(=O)C2CCCCC2)CC1
: