Target
Sodium channel protein type 4 subunit alpha
Ligand
BDBM190233
Substrate
Meas. Tech.
ChEMBL_1822230 (CHEMBL4321994)
IC50
19±n/a nM
Citation
 Mulcahy, JVPajouhesh, HBeckley, JTDelwig, ADu Bois, JHunter, JC Challenges and Opportunities for Therapeutics Targeting the Voltage-Gated Sodium Channel Isoform Na J Med Chem 62:8695-8710 (2019)  
Target
Name:
Sodium channel protein type 4 subunit alpha
Synonyms:
SCN4A SkM1 Sodium channel protein skeletal muscle subunit alpha Sodium channel protein type IV alpha subunit Voltage-gated sodium channel subunit alpha Nav1.4 | Voltage-gated sodium channel subunit alpha Nav1.4 (Nav1.4)
Type:
Protein
Mol. Mass.:
208010.01
Organism:
Homo sapiens (Human)
Description:
P35499
Residue:
1836
  
Inhibitor
Name:
BDBM190233
Synonyms:
US9174999, Table 1, Compound 1
Type:
Small organic molecule
Emp. Form.:
C10H17N7O4
Mol. Mass.:
299.2865
SMILES:
NC(=O)OC[C@@H]1NC(=N)N2CCC(O)(O)[C@@]22NC(=N)N[C@@H]12
: