Target
Kinesin-like protein KIF11
Ligand
BDBM50382559
Substrate
Meas. Tech.
ChEMBL_1822380 (CHEMBL4322144)
Ki
2.3±n/a nM
Citation
 Egbert, MWhitty, AKeser?, GMVajda, S Why Some Targets Benefit from beyond Rule of Five Drugs. J Med Chem 62:10005-10025 (2019)  
Target
Name:
Kinesin-like protein KIF11
Synonyms:
EG5 KIF11_HUMAN Kinesin Spindle Protein Eg5 TRIP5 | kinesin spindle protein
Type:
PROTEIN
Mol. Mass.:
119138.97
Organism:
Homo sapiens (Human)
Description:
ChEMBL_1457426
Residue:
1056
  
Inhibitor
Name:
BDBM50382559
Synonyms:
ISPINESIB
Type:
Small organic molecule
Emp. Form.:
C30H33ClN4O2
Mol. Mass.:
517.062
SMILES:
CC(C)[C@@H](N(CCCN)C(=O)c1ccc(C)cc1)c1nc2cc(Cl)ccc2c(=O)n1Cc1ccccc1
: