Target
BTB/POZ domain-containing protein KCTD12
Ligand
BDBM50505515
Substrate
Meas. Tech.
ChEMBL_1822935 (CHEMBL4322699)
IC50
2340±n/a nM
Citation
 Sereikaite, VFritzius, TKasaragod, VBBader, NMaric, HMSchindelin, HBettler, BStrømgaard, K Targeting the ?-Aminobutyric Acid Type B (GABA J Med Chem 62:8819-8830 (2019)  
Target
Name:
BTB/POZ domain-containing protein KCTD12
Synonyms:
BTB/POZ domain-containing protein KCTD12 KCD12_HUMAN KIAA1778 Pfetin | Predominantly fetal expressed T1 domain
Type:
PROTEIN
Mol. Mass.:
35697.33
Organism:
Homo sapiens
Description:
ChEMBL_119174
Residue:
325
  
Inhibitor
Name:
BDBM50505515
Synonyms:
CHEMBL4444138
Type:
Small organic molecule
Emp. Form.:
C113H154N28O26
Mol. Mass.:
2320.6039
SMILES:
CC[C@H](C)[C@H](NC(=O)[C@@H]1CCCN1C(=O)[C@H](CC(C)C)NC(=O)[C@H](CC(N)=O)NC(=O)[C@H](Cc1ccc(O)cc1)NC(=O)[C@@H](N)Cc1ccc(O)cc1)C(=O)N[C@@H](CC(C)C)C(=O)N[C@@H](Cc1cnc[nH]1)C(=O)N[C@@H](Cc1cnc[nH]1)C(=O)N[C@@H](C)C(=O)N[C@@H](Cc1ccc(O)cc1)C(=O)N[C@@H](CC(C)C)C(=O)N1CCC[C@H]1C(=O)N[C@@H](CO)C(=O)N[C@@H](CCCNC(N)=N)C(=O)N[C@@H](Cc1cnc[nH]1)C(=O)N[C@@H](Cc1ccc(O)cc1)C(=O)N[C@@H](Cc1ccc(O)cc1)C(O)=O
: