Target
BTB/POZ domain-containing protein KCTD12
Ligand
BDBM50505523
Substrate
Meas. Tech.
ChEMBL_1822935 (CHEMBL4322699)
IC50
10700±n/a nM
Citation
 Sereikaite, VFritzius, TKasaragod, VBBader, NMaric, HMSchindelin, HBettler, BStrømgaard, K Targeting the ?-Aminobutyric Acid Type B (GABA J Med Chem 62:8819-8830 (2019)  
Target
Name:
BTB/POZ domain-containing protein KCTD12
Synonyms:
BTB/POZ domain-containing protein KCTD12 KCD12_HUMAN KIAA1778 Pfetin | Predominantly fetal expressed T1 domain
Type:
PROTEIN
Mol. Mass.:
35697.33
Organism:
Homo sapiens
Description:
ChEMBL_119174
Residue:
325
  
Inhibitor
Name:
BDBM50505523
Synonyms:
CHEMBL4448521
Type:
Small organic molecule
Emp. Form.:
C89H141N23O23
Mol. Mass.:
1901.2121
SMILES:
CC[C@H](C)[C@H](NC(=O)C(CO)NC(=O)[C@@H]1CCCN1C(=O)[C@H](CC(C)C)NC(=O)[C@H](Cc1ccc(O)cc1)NC(=O)[C@H](C)NC(=O)[C@H](Cc1cnc[nH]1)NC(=O)[C@H](Cc1cnc[nH]1)NC(=O)[C@H](CC(C)C)NC(=O)[C@@H](NC(=O)[C@@H]1CCCN1C(=O)[C@H](CC(C)C)NC(=O)[C@H](CC(N)=O)NC(=O)[C@H](CC(C)C)NC(=O)[C@@H](N)CO)[C@@H](C)CC)C(=O)NCC(=O)NCC(=O)N[C@@H](C(C)C)C(O)=O
: