Target
Myosin light chain kinase, smooth muscle
Ligand
BDBM50505542
Substrate
Meas. Tech.
ChEMBL_1823104 (CHEMBL4322868)
Kd
298±n/a nM
Citation
 Hirozane, YToyofuku, MYogo, TTanaka, YSameshima, TMiyahisa, IYoshikawa, M Structure-based rational design of staurosporine-based fluorescent probe with broad-ranging kinase affinity for kinase panel application. Bioorg Med Chem Lett 29:0 (2019)  
Target
Name:
Myosin light chain kinase, smooth muscle
Synonyms:
KRP MLCK MYLK MYLK_HUMAN Telokin | smMLCK
Type:
Protein
Mol. Mass.:
210702.56
Organism:
Homo sapiens (Human)
Description:
Q15746
Residue:
1914
  
Inhibitor
Name:
BDBM50505542
Synonyms:
CHEMBL4576489
Type:
Small organic molecule
Emp. Form.:
C50H56BF2N7O7
Mol. Mass.:
915.83
SMILES:
[H][C@]12C[C@H]([C@@H](OC)[C@](C)(O1)n1c3ccccc3c3c4CNC(=O)c4c4c5ccccc5n2c4c13)N(C)CCOCCOCCOCCNC(=O)CCC1=[N+]2C(C=C1)=Cc1c(C)cc(C)n1[B-]2(F)F
: