Target
Serine/threonine-protein kinase Sgk2
Ligand
BDBM50505542
Substrate
Meas. Tech.
ChEMBL_1823023 (CHEMBL4322787)
Kd
1771±n/a nM
Citation
 Hirozane, YToyofuku, MYogo, TTanaka, YSameshima, TMiyahisa, IYoshikawa, M Structure-based rational design of staurosporine-based fluorescent probe with broad-ranging kinase affinity for kinase panel application. Bioorg Med Chem Lett 29:0 (2019)  
Target
Name:
Serine/threonine-protein kinase Sgk2
Synonyms:
SGK2 | SGK2_HUMAN
Type:
PROTEIN
Mol. Mass.:
47609.83
Organism:
Homo sapiens (Human)
Description:
ChEMBL_1445193
Residue:
427
  
Inhibitor
Name:
BDBM50505542
Synonyms:
CHEMBL4576489
Type:
Small organic molecule
Emp. Form.:
C50H56BF2N7O7
Mol. Mass.:
915.83
SMILES:
[H][C@]12C[C@H]([C@@H](OC)[C@](C)(O1)n1c3ccccc3c3c4CNC(=O)c4c4c5ccccc5n2c4c13)N(C)CCOCCOCCOCCNC(=O)CCC1=[N+]2C(C=C1)=Cc1c(C)cc(C)n1[B-]2(F)F
: