Target
Serine/threonine-protein kinase Sgk2
Ligand
BDBM50505541
Substrate
Meas. Tech.
ChEMBL_1823023 (CHEMBL4322787)
Kd
1221±n/a nM
Citation
 Hirozane, YToyofuku, MYogo, TTanaka, YSameshima, TMiyahisa, IYoshikawa, M Structure-based rational design of staurosporine-based fluorescent probe with broad-ranging kinase affinity for kinase panel application. Bioorg Med Chem Lett 29:0 (2019)  
Target
Name:
Serine/threonine-protein kinase Sgk2
Synonyms:
SGK2 | SGK2_HUMAN
Type:
PROTEIN
Mol. Mass.:
47609.83
Organism:
Homo sapiens (Human)
Description:
ChEMBL_1445193
Residue:
427
  
Inhibitor
Name:
BDBM50505541
Synonyms:
CHEMBL4465866
Type:
Small organic molecule
Emp. Form.:
C49H54BF2N7O7
Mol. Mass.:
901.804
SMILES:
[H][C@]12C[C@@H](NCCOCCOCCOCCNC(=O)CCC3=[N+]4C(C=C3)=Cc3c(C)cc(C)n3[B-]4(F)F)[C@@H](OC)[C@](C)(O1)n1c3ccccc3c3c4CNC(=O)c4c4c5ccccc5n2c4c13
: