Target
Procathepsin L
Ligand
BDBM50505562
Substrate
Meas. Tech.
ChEMBL_1823200 (CHEMBL4322964)
IC50
1.4±n/a nM
Citation
 Boudreau, PDMiller, BWMcCall, LIAlmaliti, JReher, RHirata, KLe, TSiqueira-Neto, JLHook, VGerwick, WH Design of Gallinamide A Analogs as Potent Inhibitors of the Cysteine Proteases Human Cathepsin L and  J Med Chem 62:9026-9044 (2019)  
Target
Name:
Procathepsin L
Synonyms:
CATL1_HUMAN CTSL CTSL1 Cathepsin L Cathepsin L1 heavy chain MEP cathepsin L preproprotein
Type:
Enzyme
Mol. Mass.:
37557.19
Organism:
Homo sapiens (Human)
Description:
Purchased from Calbiochem (San Diego, CA).
Residue:
333
  
Inhibitor
Name:
BDBM50505562
Synonyms:
CHEMBL4445744
Type:
Small organic molecule
Emp. Form.:
C40H54N4O7
Mol. Mass.:
702.8794
SMILES:
COC1=CC(=O)N([C@H]1Cc1ccccc1)C(=O)\C=C\[C@H](C)NC(=O)[C@H](CC(C)C)NC(=O)[C@H](CC(C)C)OC(=O)[C@H](Cc1ccccc1)N(C)C
: