Target
Fucose-binding lectin PA-IIL
Ligand
BDBM50505604
Substrate
Meas. Tech.
ChEMBL_1823415 (CHEMBL4323179)
Kd
320±n/a nM
Citation
 Sommer, RRox, KWagner, SHauck, DHenrikus, SSNewsad, SArnold, TRyckmans, TBrönstrup, MImberty, AVarrot, AHartmann, RWTitz, A Anti-biofilm Agents against  J Med Chem 62:9201-9216 (2019)  
Target
Name:
Fucose-binding lectin PA-IIL
Synonyms:
LecB | PA-IIL
Type:
Protein
Mol. Mass.:
11857.84
Organism:
Pseudomonas aeruginosa
Description:
Q9HYN5
Residue:
115
  
Inhibitor
Name:
BDBM50505604
Synonyms:
CHEMBL4574479
Type:
Small organic molecule
Emp. Form.:
C13H21NO6S2
Mol. Mass.:
351.439
SMILES:
C[C@@H]1O[C@H](CNS(=O)(=O)c2cc(C)sc2C)[C@@H](O)[C@H](O)[C@@H]1O
: