Target
Mu-type opioid receptor
Ligand
BDBM50057387
Substrate
Meas. Tech.
ChEMBL_145162 (CHEMBL753422)
Ki
75±n/a nM
Citation
 Arttamangkul, SIshmael, JEMurray, TFGrandy, DKDeLander, GEKieffer, BLAldrich, JV Synthesis and opioid activity of conformationally constrained dynorphin A analogues. 2. Conformational constraint in the"address" sequence. J Med Chem 40:1211-8 (1997)  
Target
Name:
Mu-type opioid receptor
Synonyms:
M-OR-1 Mu opioid receptor OPIATE Mu OPRM_CAVPO
Type:
Enzyme Catalytic Domain
Mol. Mass.:
11165.58
Organism:
GUINEA PIG
Description:
P97266
Residue:
98
  
Inhibitor
Name:
BDBM50057387
Synonyms:
Analog of Dynorphin A | CHEMBL412364
Type:
Small organic molecule
Emp. Form.:
C70H113N25O16
Mol. Mass.:
1560.8041
SMILES:
CC(C)C[C@H](NC(=O)[C@H](CCCCN)NC(=O)[C@@H]1CCCN1C(=O)[C@H](CCCNC(N)=N)NC(=O)[C@H]1CNC(=O)[C@H](CCCNC(N)=N)NC(=O)[C@@H](CCCNC(N)=N)NC(=O)[C@@H](CC(=O)N1)NC(=O)[C@H](Cc1ccccc1)NC(=O)CNC(=O)CNC(=O)[C@@H](N)Cc1ccc(O)cc1)C(=O)N[C@@H](CCCCN)C(O)=O
: