Target
Luteinizing hormone/choriogondaotropin receptor
Ligand
BDBM50505787
Substrate
Meas. Tech.
ChEMBL_1824038 (CHEMBL4323802)
IC50
78±n/a nM
Citation
 Wortmann, LLindenthal, BMuhn, PWalter, ANubbemeyer, RHeldmann, DSobek, LMorandi, FSchrey, AKMoosmayer, DGünther, JKuhnke, JKoppitz, MLücking, URöhn, USchäfer, MNowak-Reppel, KKühne, RWeinmann, HLanger, G Discovery of BAY-298 and BAY-899: Tetrahydro-1,6-naphthyridine-Based, Potent, and Selective Antagonists of the Luteinizing Hormone Receptor Which Reduce Sex Hormone Levels in Vivo. J Med Chem 62:10321-10341 (2019)  
Target
Name:
Luteinizing hormone/choriogondaotropin receptor
Synonyms:
Luteinizing hormone/choriogondaotropin receptor
Type:
PROTEIN
Mol. Mass.:
11793.16
Organism:
Macaca fascicularis
Description:
ChEMBL_118864
Residue:
104
  
Inhibitor
Name:
BDBM50505787
Synonyms:
CHEMBL4537998
Type:
Small organic molecule
Emp. Form.:
C27H21ClFN3O2
Mol. Mass.:
473.926
SMILES:
Fc1ccc(Oc2ccc(NC(=O)N3CCc4ncccc4[C@@H]3c3ccc(Cl)cc3)cc2)cc1
: