Target
C-X-C chemokine receptor type 2
Ligand
BDBM50140794
Substrate
Meas. Tech.
ChEMBL_1824904 (CHEMBL4324668)
IC50
320±n/a nM
Citation
 Che, JSong, RChen, BDong, X Targeting CXCR1/2: The medicinal potential as cancer immunotherapy agents, antagonists research highlights and challenges ahead. Eur J Med Chem 185:0 (2020)  
Target
Name:
C-X-C chemokine receptor type 2
Synonyms:
C-X-C chemokine receptor type 2 (CXCR-2) CD_antigen=CD182 CXCR-2 CXCR2_HUMAN GRO/MGSA receptor IL-8 receptor type 2 IL8RB | Interleukin-8 receptor B
Type:
Protein
Mol. Mass.:
40767.88
Organism:
Homo sapiens (Human)
Description:
P25025
Residue:
360
  
Inhibitor
Name:
BDBM50140794
Synonyms:
1-(2-Hydroxy-4-nitro-phenyl)-3-phenyl-urea CHEMBL280711
Type:
Small organic molecule
Emp. Form.:
C13H11N3O4
Mol. Mass.:
273.2441
SMILES:
Oc1cc(ccc1NC(=O)Nc1ccccc1)[N+]([O-])=O
: