Target
Histone acetyltransferase p300
Ligand
BDBM50506377
Substrate
Meas. Tech.
ChEMBL_1825663 (CHEMBL4325427)
IC50
1.3±n/a nM
Citation
 Yang, YZhang, RLi, ZMei, LWan, SDing, HChen, ZXing, JFeng, HHan, JJiang, HZheng, MLuo, CZhou, B Discovery of Highly Potent, Selective, and Orally Efficacious p300/CBP Histone Acetyltransferases Inhibitors. J Med Chem 63:1337-1360 (2020)  
Target
Name:
Histone acetyltransferase p300
Synonyms:
EP300 HIF1A/p300/CREB-binding protein P300
Type:
Protein
Mol. Mass.:
264223.04
Organism:
Homo sapiens (Human)
Description:
Q09472
Residue:
2414
  
Inhibitor
Name:
BDBM50506377
Synonyms:
CHEMBL4567310
Type:
Small organic molecule
Emp. Form.:
C29H28FN5O4
Mol. Mass.:
529.5621
SMILES:
Cn1cc(cn1)-c1ccc2c(CC[C@]22NC(=O)N(CC(=O)N3Cc4cc(F)ccc4OC[C@H]3C3CC3)C2=O)c1
: