Target
Dihydrofolate reductase
Ligand
BDBM50029766
Substrate
Meas. Tech.
ChEMBL_55125 (CHEMBL665451)
IC50
7.6±n/a nM
Citation
 Gangjee, AShi, JQueener, SF Synthesis and biological activities of conformationally restricted, tricyclic nonclassical antifolates as inhibitors of dihydrofolate reductases. J Med Chem 40:1930-6 (1997)  
Target
Name:
Dihydrofolate reductase
Synonyms:
DYR_RAT Dihydrofolate reductase (DHFR) Tetrahydrofolate dehydrogenase
Type:
Enzyme
Mol. Mass.:
21638.84
Organism:
Rattus norvegicus (rat)
Description:
Residue:
187
  
Inhibitor
Name:
BDBM50029766
Synonyms:
2,4-DIAMINO-5-METHYL-6-[(3,4,5-TRIMETHOXY-N-METHYLANILINO)METHYL]PYRIDO[2,3-D]PYRIMIDINE CHEMBL50514
Type:
Small organic molecule
Emp. Form.:
C19H24N6O3
Mol. Mass.:
384.4323
SMILES:
COc1cc(cc(OC)c1OC)N(C)Cc1cnc2nc(N)nc(N)c2c1C
: