Target
Cathepsin D
Ligand
BDBM50506517
Substrate
Meas. Tech.
ChEMBL_1826027 (CHEMBL4325791)
IC50
4.2±n/a nM
Citation
 Hou?tecká, RHadzima, MFanfrlík, JBrynda, JPallová, LHánová, IMertlíková-Kaiserová, HLep?ík, MHorn, MSmr?ina, MMajer, PMare?, M Biomimetic Macrocyclic Inhibitors of Human Cathepsin D: Structure-Activity Relationship and Binding Mode Analysis. J Med Chem 63:1576-1596 (2020)  
Target
Name:
Cathepsin D
Synonyms:
CATD_HUMAN CTSD Cathepsin D heavy chain Cathepsin D precursor
Type:
Enzyme
Mol. Mass.:
44551.72
Organism:
Homo sapiens (Human)
Description:
Human proCathepsin D (SwissProt accession number P07339) was expressed in Sf9 cells, purified, and autoactivated.
Residue:
412
  
Inhibitor
Name:
BDBM50506517
Synonyms:
CHEMBL4569563
Type:
Small organic molecule
Emp. Form.:
C28H43Cl2N3O4
Mol. Mass.:
556.565
SMILES:
CC(C)[C@@H]1NC(=O)C[C@H](O)[C@H](Cc2ccc(Cl)c(Cl)c2)NC(=O)CCCCCCCCCCCNC1=O
: