Target
Adenosine receptor A3
Ligand
BDBM50059397
Substrate
Meas. Tech.
ChEMBL_32001 (CHEMBL646598)
Ki
5560±n/a nM
Citation
 Jiang, Jvan Rhee, AMChang, LPatchornik, AJi, XDEvans, PMelman, NJacobson, KA Structure-activity relationships of 4-(phenylethynyl)-6-phenyl-1,4-dihydropyridines as highly selective A3 adenosine receptor antagonists. J Med Chem 40:2596-608 (1997)  
Target
Name:
Adenosine receptor A3
Synonyms:
A3 adenosine receptor (hA3) ADORA3 | Adenosine A3 receptor (A3AR)
Type:
G Protein-Coupled Receptor (GPCR)
Mol. Mass.:
36197.32
Organism:
Homo sapiens (Human)
Description:
P0DMS8
Residue:
318
  
Inhibitor
Name:
BDBM50059397
Synonyms:
5-Ethylcarbamoyl-2-methyl-6-phenyl-4-phenylethynyl-1,4-dihydro-pyridine-3-carboxylic acid ethyl ester | CHEMBL315897
Type:
Small organic molecule
Emp. Form.:
C26H26N2O3
Mol. Mass.:
414.4962
SMILES:
CCNC(=O)C1=C(N=C(C)C(C1C#Cc1ccccc1)C(=O)OCC)c1ccccc1
: