Target
Prostaglandin G/H synthase 2
Ligand
BDBM11639
Substrate
Meas. Tech.
ChEMBL_1829523 (CHEMBL4329397)
IC50
540±n/a nM
Citation
 Marín-Ocampo, LVeloza, LAAbonia, RSepúlveda-Arias, JC Anti-inflammatory activity of triazine derivatives: A systematic review. Eur J Med Chem 162:435-447 (2019)  
Target
Name:
Prostaglandin G/H synthase 2
Synonyms:
COX2 Cyclooxygenase-2 (COX-2) PTGS2 Prostaglandin G/H synthase (cyclooxygenase)
Type:
Protein
Mol. Mass.:
68976.98
Organism:
Ovis aries (Sheep)
Description:
Residue:
603
  
Inhibitor
Name:
BDBM11639
Synonyms:
4-[5-(4-methylphenyl)-3-(trifluoromethyl)-1H-pyrazol-1-yl]benzene-1-sulfonamide CLX Celecoxib US11478464, Compound Celecoxib US8741944, Comparative Compound cid_2662
Type:
Small organic molecule
Emp. Form.:
C17H14F3N3O2S
Mol. Mass.:
381.372
SMILES:
Cc1ccc(cc1)-c1cc(nn1-c1ccc(cc1)S(N)(=O)=O)C(F)(F)F
: