Target
Prostaglandin G/H synthase 2
Ligand
BDBM198172
Substrate
Meas. Tech.
ChEMBL_1829523 (CHEMBL4329397)
IC50
600±n/a nM
Citation
 Marín-Ocampo, LVeloza, LAAbonia, RSepúlveda-Arias, JC Anti-inflammatory activity of triazine derivatives: A systematic review. Eur J Med Chem 162:435-447 (2019)  
Target
Name:
Prostaglandin G/H synthase 2
Synonyms:
COX2 Cyclooxygenase-2 (COX-2) PTGS2 Prostaglandin G/H synthase (cyclooxygenase)
Type:
Protein
Mol. Mass.:
68976.98
Organism:
Ovis aries (Sheep)
Description:
Residue:
603
  
Inhibitor
Name:
BDBM198172
Synonyms:
2-((5-(4-Chlorophenylamino)-1,3,4-oxadiazol-2-yl)methyl)-5,6-diphenyl-1,2,4-triazin-3(2H)-one (3d)
Type:
Small organic molecule
Emp. Form.:
C24H17ClN6O2
Mol. Mass.:
456.884
SMILES:
Clc1ccc(Nc2nnc(Cn3nc(-c4ccccc4)c(nc3=O)-c3ccccc3)o2)cc1
: