Target
Prostaglandin G/H synthase 2
Ligand
BDBM50507268
Substrate
Meas. Tech.
ChEMBL_1829520 (CHEMBL4329394)
IC50
10100±n/a nM
Citation
 Marín-Ocampo, LVeloza, LAAbonia, RSepúlveda-Arias, JC Anti-inflammatory activity of triazine derivatives: A systematic review. Eur J Med Chem 162:435-447 (2019)  
Target
Name:
Prostaglandin G/H synthase 2
Synonyms:
COX2 Cyclooxygenase 2 (COX-2) Cyclooxygenase-2 (COX-2 AA) Cyclooxygenase-2 (COX-2) PGH2_HUMAN PHS II Prostaglandin E synthase/G/H synthase 2 Prostaglandin-endoperoxide synthase 2
Type:
Enzyme
Mol. Mass.:
69003.89
Organism:
Homo sapiens (Human)
Description:
Recombinant Cox-2 provided by Cayman (Cayman Chemical Co.,Ann Arbor, MI).
Residue:
604
  
Inhibitor
Name:
BDBM50507268
Synonyms:
CHEMBL4456497
Type:
Small organic molecule
Emp. Form.:
C21H21N3O4S2
Mol. Mass.:
443.539
SMILES:
CCOC(=O)CSc1nnc(-c2ccc(cc2)S(C)(=O)=O)c(n1)-c1ccc(C)cc1
: