Target
Mu-type opioid receptor
Ligand
BDBM50059786
Substrate
Meas. Tech.
ChEMBL_149139 (CHEMBL759230)
Ki
7.7±n/a nM
Citation
 Grauert, MBechtel, WDEnsinger, HAMerz, HCarter, AJ Synthesis and structure-activity relationships of 6,7-benzomorphan derivatives as antagonists of the NMDA receptor-channel complex. J Med Chem 40:2922-30 (1997)  
Target
Name:
Mu-type opioid receptor
Synonyms:
MOR-1 Mu-type opioid receptor (MOR) OPRM_RAT Opioid receptor B Ror-b
Type:
G Protein-Coupled Receptor (GPCR)
Mol. Mass.:
44503.11
Organism:
Rattus norvegicus (rat)
Description:
Competition binding assays were carried out using membrane preparations from transfected HN9.10 cells that constitutively expressed the mu opioid receptor.
Residue:
398
  
Inhibitor
Name:
BDBM50059786
Synonyms:
(2R,6S,11R)-6,11-Dimethyl-3-((R)-2-methylsulfanyl-propyl)-1,2,3,4,5,6-hexahydro-2,6-methano-benzo[d]azocin-8-ol | CHEMBL98817
Type:
Small organic molecule
Emp. Form.:
C18H27NOS
Mol. Mass.:
305.478
SMILES:
CS[C@H](C)CN1CC[C@@]2(C)[C@@H](C)[C@H]1Cc1ccc(O)cc21
: