Target
Acetylcholinesterase
Ligand
BDBM120262
Substrate
Meas. Tech.
ChEMBL_28743 (CHEMBL641512)
Ki
200±n/a nM
Citation
 Boyle, NATalesa, VGiovannini, ERosi, GNorton, SJ Synthesis and study of thiocarbonate derivatives of choline as potential inhibitors of acetylcholinesterase. J Med Chem 40:3009-13 (1997)  
Target
Name:
Acetylcholinesterase
Synonyms:
ACES_HUMAN Acetylcholinesterase (AChE) | Acetylcholinesterase (human AChE)
Type:
Enzyme
Mol. Mass.:
67792.70
Organism:
Homo sapiens (Human)
Description:
P22303
Residue:
614
  
Inhibitor
Name:
BDBM120262
Synonyms:
EDROPHONIUM BROMIDE Edrophonium cid_8307
Type:
Small organic molecule
Emp. Form.:
C10H16NO
Mol. Mass.:
166.2396
SMILES:
CC[N+](C)(C)c1cccc(O)c1
: