Target
Macrophage-stimulating protein receptor
Ligand
BDBM50172078
Substrate
Meas. Tech.
ChEMBL_1830206 (CHEMBL4330214)
IC50
1.2±n/a nM
Citation
 Yan, WLakkaniga, NRCarlomagno, FSantoro, MMcDonald, NQLv, FGunaganti, NFrett, BLi, HY Insights into Current Tropomyosin Receptor Kinase (TRK) Inhibitors: Development and Clinical Application. J Med Chem 62:1731-1760 (2019)  
Target
Name:
Macrophage-stimulating protein receptor
Synonyms:
2.7.10.1 CDw136 MST1R Macrophage-stimulating protein receptor alpha chain PTK8 RON Tyrosine kinase receptor ron | p185-Ron
Type:
Protein
Mol. Mass.:
152270.76
Organism:
Homo sapiens (Human)
Description:
Q04912
Residue:
1400
  
Inhibitor
Name:
BDBM50172078
Synonyms:
LY-2801653 | Merestinib
Type:
Small organic molecule
Emp. Form.:
C30H22F2N6O3
Mol. Mass.:
552.5309
SMILES:
Cc1ccc(C(=O)Nc2ccc(Oc3cc4cnn(C)c4cc3-c3cn[nH]c3)c(F)c2)c(=O)n1-c1ccc(F)cc1
: