Target
Insulin-like growth factor 1 receptor
Ligand
BDBM50299148
Substrate
Meas. Tech.
ChEMBL_1830194 (CHEMBL4330202)
IC50
1.8±n/a nM
Citation
 Yan, WLakkaniga, NRCarlomagno, FSantoro, MMcDonald, NQLv, FGunaganti, NFrett, BLi, HY Insights into Current Tropomyosin Receptor Kinase (TRK) Inhibitors: Development and Clinical Application. J Med Chem 62:1731-1760 (2019)  
Target
Name:
Insulin-like growth factor 1 receptor
Synonyms:
CD_antigen=CD221 IGF1R Insulin-like growth factor 1 receptor (IGF1R) Insulin-like growth factor 1 receptor alpha chain Insulin-like growth factor I receptor | Insulin-like growth factor receptor (IGFR)
Type:
Protein
Mol. Mass.:
154776.79
Organism:
Homo sapiens (Human)
Description:
P08069
Residue:
1367
  
Inhibitor
Name:
BDBM50299148
Synonyms:
(S)-1-(4-(5-cyclopropyl-1H-pyrazol-3-ylamino)pyrrolo[1,2-f][1,2,4]triazin-2-yl)-N-(6-fluoropyridin-3-yl)-2-methylpyrrolidine-2-carboxamide BMS-754807 | CHEMBL575448
Type:
Small organic molecule
Emp. Form.:
C23H24FN9O
Mol. Mass.:
461.4948
SMILES:
C[C@]1(CCCN1c1nc(Nc2cc([nH]n2)C2CC2)c2cccn2n1)C(=O)Nc1ccc(F)nc1
: