Target
Metabotropic glutamate receptor 4
Ligand
BDBM66976
Substrate
Meas. Tech.
ChEMBL_106545 (CHEMBL715490)
EC50
>1000000±n/a nM
Citation
 Acher, FCTellier, FJAzerad, RBrabet, INFagni, LPin, JP Synthesis and pharmacological characterization of aminocyclopentanetricarboxylic acids: new tools to discriminate between metabotropic glutamate receptor subtypes. J Med Chem 40:3119-29 (1997)  
Target
Name:
Metabotropic glutamate receptor 4
Synonyms:
GPRC1D GRM4_HUMAN MGLUR4 Metabotropic glutamate receptor 4 (mGlu4) metabotropic glutamate 4
Type:
Protein
Mol. Mass.:
101899.95
Organism:
Homo sapiens (Human)
Description:
Q14833
Residue:
912
  
Inhibitor
Name:
BDBM66976
Synonyms:
(1S,3R)-1-aminocyclopentane-1,3-dicarboxylic acid;hydrate CHEMBL34453 SMR001230688 trans-( )-ACPD monohydrate
Type:
Small organic molecule
Emp. Form.:
C7H11NO4
Mol. Mass.:
173.1665
SMILES:
N[C@]1(CC[C@H](C1)C(O)=O)C(O)=O
: