Target
Metabotropic glutamate receptor 2
Ligand
BDBM50004863
Substrate
Meas. Tech.
ChEMBL_105891 (CHEMBL717752)
EC50
13000±n/a nM
Citation
 Acher, FCTellier, FJAzerad, RBrabet, INFagni, LPin, JP Synthesis and pharmacological characterization of aminocyclopentanetricarboxylic acids: new tools to discriminate between metabotropic glutamate receptor subtypes. J Med Chem 40:3119-29 (1997)  
Target
Name:
Metabotropic glutamate receptor 2
Synonyms:
GPRC1B GRM2_HUMAN Metabotropic glutamate receptor mGlu2 | metabotropic glutamate 2
Type:
Enzyme
Mol. Mass.:
95584.88
Organism:
Homo sapiens (Human)
Description:
Q14416
Residue:
872
  
Inhibitor
Name:
BDBM50004863
Synonyms:
(+/-)-trans-ACPD (1S,3S)-1-aminocyclopentane-1,3-dicarboxylic acid 1-Amino-cyclopentane-1,3-dicarboxylic acid(cis-(1S,3S)-ACPD) 1R,3S-ACPD CHEMBL29726
Type:
Small organic molecule
Emp. Form.:
C7H11NO4
Mol. Mass.:
173.1665
SMILES:
N[C@]1(CC[C@@H](C1)C(O)=O)C(O)=O
: