Target
Cytochrome P450 1B1
Ligand
BDBM23409
Substrate
Meas. Tech.
ChEMBL_1830564 (CHEMBL4330572)
Ki
3000±n/a nM
Citation
 Mohd Siddique, MUBarbhuiya, TKSinha, BNJayaprakash, V Phytoestrogens and their synthetic analogues as substrate mimic inhibitors of CYP1B1. Eur J Med Chem 163:28-36 (2019)  
Target
Name:
Cytochrome P450 1B1
Synonyms:
CP1B1_HUMAN CYPIB1 | Cytochrome P450 1B1 (CYP1B1)
Type:
PROTEIN
Mol. Mass.:
60861.81
Organism:
Homo sapiens (Human)
Description:
ChEMBL_1474523
Residue:
543
  
Inhibitor
Name:
BDBM23409
Synonyms:
3,5,7-trihydroxy-2-(4-hydroxy-3-methoxyphenyl)-4H-chromen-4-one Isorhamnetin | Isorhamnetin (17)
Type:
flavonol
Emp. Form.:
C16H12O7
Mol. Mass.:
316.2623
SMILES:
COc1cc(ccc1O)-c1oc2cc(O)cc(O)c2c(=O)c1O
: