Target
Cytochrome P450 1A2
Ligand
BDBM50060417
Substrate
Meas. Tech.
ChEMBL_51361 (CHEMBL663693)
IC50
50±n/a nM
Citation
 Bromidge, SMDuckworth, MForbes, ITHam, PKing, FDThewlis, KMBlaney, FENaylor, CBBlackburn, TPKennett, GAWood, MDClarke, SE 6-Chloro-5-methyl-1-[[2-[(2-methyl-3-pyridyl)oxy]-5-pyridyl]carbamoyl]- indoline (SB-242084): the first selective and brain penetrant 5-HT2C receptor antagonist. J Med Chem 40:3494-6 (1997)  
Target
Name:
Cytochrome P450 1A2
Synonyms:
CP1A2_HUMAN CYPIA2 Cytochrome P(3)450 Cytochrome P450 1A2 (CYP1A2) Cytochrome P450-P3
Type:
Enzyme
Mol. Mass.:
58423.38
Organism:
Homo sapiens (Human)
Description:
P05177
Residue:
516
  
Inhibitor
Name:
BDBM50060417
Synonyms:
5-Methyl-3,5-dihydro-2H-pyrrolo[2,3-f]indole-1-carboxylic acid pyridin-3-ylamide SB 206553 | SB-206553
Type:
Small organic molecule
Emp. Form.:
C17H16N4O
Mol. Mass.:
292.3351
SMILES:
Cn1ccc2cc3N(CCc3cc12)C(=O)Nc1cccnc1
: