Target
5-hydroxytryptamine receptor 1D
Ligand
BDBM50060425
Substrate
Meas. Tech.
ChEMBL_1697 (CHEMBL616904)
IC50
0.5±n/a nM
Citation
 Castro, JLStreet, LJGuiblin, ARJelley, RARussell, MGSternfeld, FBeer, MSStanton, JAMatassa, VG 3-[2-(Pyrrolidin-1-yl)ethyl]indoles and 3-[3-(piperidin-1-yl)propyl]indoles: agonists for the h5-HT1D receptor with high selectivity over the h5-HT1B subtype. J Med Chem 40:3497-500 (1997)  
Target
Name:
5-hydroxytryptamine receptor 1D
Synonyms:
5-HT-1D 5-HT1D 5HT1D_HUMAN HTR1DA Serotonin (5-HT) receptor | Serotonin Receptor 1D
Type:
G Protein-Coupled Receptor (GPCR)
Mol. Mass.:
41920.63
Organism:
Homo sapiens (Human)
Description:
Receptor binding assays were performed using human clone stably expressed in CHO cells.
Residue:
377
  
Inhibitor
Name:
BDBM50060425
Synonyms:
Benzyl-{(S)-1-[2-(5-[1,2,4]triazol-4-yl-1H-indol-3-yl)-ethyl]-pyrrolidin-3-ylmethyl}-amine L-760790
Type:
Small organic molecule
Emp. Form.:
C24H28N6
Mol. Mass.:
400.5193
SMILES:
C(Cc1c[nH]c2ccc(cc12)-n1cnnc1)N1CC[C@@H](CNCc2ccccc2)C1
: