Target
5-hydroxytryptamine receptor 1D
Ligand
BDBM50060436
Substrate
Meas. Tech.
ChEMBL_1696 (CHEMBL616903)
IC50
0.6±n/a nM
Citation
 MacLeod, AMStreet, LJReeve, AJJelley, RASternfeld, FBeer, MSStanton, JAWatt, APRathbone, DMatassa, VG Selective, orally active 5-HT1D receptor agonists as potential antimigraine agents. J Med Chem 40:3501-3 (1997)  
Target
Name:
5-hydroxytryptamine receptor 1D
Synonyms:
5-HT-1D 5-HT1D 5HT1D_HUMAN HTR1DA Serotonin (5-HT) receptor | Serotonin Receptor 1D
Type:
G Protein-Coupled Receptor (GPCR)
Mol. Mass.:
41920.63
Organism:
Homo sapiens (Human)
Description:
Receptor binding assays were performed using human clone stably expressed in CHO cells.
Residue:
377
  
Inhibitor
Name:
BDBM50060436
Synonyms:
3-(3-{4-[2-(2-Fluoro-phenyl)-ethyl]-piperazin-1-yl}-propyl)-5-[1,2,4]triazol-4-yl-1H-indole | CHEMBL116031
Type:
Small organic molecule
Emp. Form.:
C25H29FN6
Mol. Mass.:
432.5364
SMILES:
Fc1ccccc1CCN1CCN(CCCc2c[nH]c3ccc(cc23)-n2cnnc2)CC1
: