Target
Plasmepsin I
Ligand
BDBM50507788
Substrate
Meas. Tech.
ChEMBL_1831643 (CHEMBL4331651)
IC50
800±n/a nM
Citation
 Zogota, RKinena, LWithers-Martinez, CBlackman, MJBobrovs, RPantelejevs, TKanepe-Lapsa, IOzola, VJaudzems, KSuna, EJirgensons, A Peptidomimetic plasmepsin inhibitors with potent anti-malarial activity and selectivity against cathepsin D. Eur J Med Chem 163:344-352 (2019)  
Target
Name:
Plasmepsin I
Synonyms:
PFAPG PMI Plasmepsin-1 precursor
Type:
Enzyme
Mol. Mass.:
51463.30
Organism:
Plasmodium falciparum
Description:
Residue:
452
  
Inhibitor
Name:
BDBM50507788
Synonyms:
CHEMBL4475791
Type:
Small organic molecule
Emp. Form.:
C37H50N4O4
Mol. Mass.:
614.8173
SMILES:
CCN(CC)C(=O)c1cc(cc(c1)C(=O)N[C@@H](Cc1ccccc1)[C@H](O)CNC(C)(C)c1cccc(OC)c1)N1CCCCC1
: