Target
Plasmepsin IV [1-448]
Ligand
BDBM50507805
Substrate
Meas. Tech.
ChEMBL_1831639 (CHEMBL4331647)
IC50
8.0±n/a nM
Citation
 Zogota, RKinena, LWithers-Martinez, CBlackman, MJBobrovs, RPantelejevs, TKanepe-Lapsa, IOzola, VJaudzems, KSuna, EJirgensons, A Peptidomimetic plasmepsin inhibitors with potent anti-malarial activity and selectivity against cathepsin D. Eur J Med Chem 163:344-352 (2019)  
Target
Name:
Plasmepsin IV [1-448]
Synonyms:
PLM4_PLAF7 Plasmepsin 4 (PM-IV)
Type:
Enzyme
Mol. Mass.:
50925.00
Organism:
Plasmodium falciparum
Description:
Q8IM16[1-448]
Residue:
448
  
Inhibitor
Name:
BDBM50507805
Synonyms:
CHEMBL4545195
Type:
Small organic molecule
Emp. Form.:
C34H44ClN3O4
Mol. Mass.:
594.184
SMILES:
CCCN(CCC)C(=O)c1cc(Cl)cc(c1)C(=O)N[C@@H](Cc1ccccc1)[C@H](O)CNC(C)(C)c1cccc(OC)c1
: