Target
Macrophage-stimulating protein receptor
Ligand
BDBM50427138
Substrate
Meas. Tech.
ChEMBL_1831751 (CHEMBL4331759)
IC50
7.0±n/a nM
Citation
 Yuan, XWu, HBu, HZhou, JZhang, H Targeting the immunity protein kinases for immuno-oncology. Eur J Med Chem 163:413-427 (2019)  
Target
Name:
Macrophage-stimulating protein receptor
Synonyms:
2.7.10.1 CDw136 MST1R Macrophage-stimulating protein receptor alpha chain PTK8 RON Tyrosine kinase receptor ron | p185-Ron
Type:
Protein
Mol. Mass.:
152270.76
Organism:
Homo sapiens (Human)
Description:
Q04912
Residue:
1400
  
Inhibitor
Name:
BDBM50427138
Synonyms:
CHEMBL2323775 | MK-8033
Type:
Small organic molecule
Emp. Form.:
C25H21N5O3S
Mol. Mass.:
471.531
SMILES:
Cn1cc(cn1)-c1cnc2ccc3ccc(CS(=O)(=O)NCc4ccccn4)cc3c(=O)c2c1
: