Target
Carbonic anhydrase 7
Ligand
BDBM50507820
Substrate
Meas. Tech.
ChEMBL_1831754 (CHEMBL4331762)
Ki
0.630000±n/a nM
Citation
 Buemi, MRDi Fiore, ADe Luca, LAngeli, AMancuso, FFerro, SMonti, SMBuonanno, MRusso, EDe Sarro, GDe Simone, GSupuran, CTGitto, R Exploring structural properties of potent human carbonic anhydrase inhibitors bearing a 4-(cycloalkylamino-1-carbonyl)benzenesulfonamide moiety. Eur J Med Chem 163:443-452 (2019)  
Target
Name:
Carbonic anhydrase 7
Synonyms:
CA-VII CAH7_HUMAN Carbonic anhydrase Carbonic anhydrase VII (CA VII)
Type:
Enzyme
Mol. Mass.:
29664.11
Organism:
Homo sapiens (Human)
Description:
Human cloned isozyme.
Residue:
264
  
Inhibitor
Name:
BDBM50507820
Synonyms:
CHEMBL4593188
Type:
Small organic molecule
Emp. Form.:
C19H22N2O3S
Mol. Mass.:
358.455
SMILES:
NS(=O)(=O)c1ccc(cc1)C(=O)N1CCC(Cc2ccccc2)CC1
: